Target
Histamine H4 receptor
Ligand
BDBM50415769
Substrate
Meas. Tech.
ChEMBL_614999 (CHEMBL1116876)
Ki
2±n/a nM
Citation
 Koenig, JRLiu, HDrizin, IWitte, DGCarr, TLManelli, AMMilicic, IStrakhova, MIMiller, TREsbenshade, TABrioni, JDCowart, M Rigidified 2-aminopyrimidines as histamine H4 receptor antagonists: effects of substitution about the rigidifying ring. Bioorg Med Chem Lett 20:1900-4 (2010)  
Target
Name:
Histamine H4 receptor
Synonyms:
AXOR35 GPCR105 HH4R HRH4 Histamine H4 receptor Histamine receptor (H3 and H4) SP9144
Type:
G Protein-Coupled Receptor (GPCR)
Mol. Mass.:
44517.02
Organism:
Homo sapiens (Human)
Description:
Binding assays were using CHO cells stably expressing hH4R receptors.
Residue:
390
  
Inhibitor
Name:
BDBM50415769
Synonyms:
CHEMBL1089390
Type:
Small organic molecule
Emp. Form.:
C17H27N5
Mol. Mass.:
301.4298
SMILES:
CN[C@@H]1CCN(C1)c1nc(N)nc2c1CCCC21CCCC1
: