Target
Alpha-1D adrenergic receptor
Ligand
BDBM50409811
Substrate
Meas. Tech.
ChEMBL_615925 (CHEMBL1099771)
Ki
9.33±n/a nM
Citation
 Franchini, SPrandi, ASorbi, CTait, ABaraldi, AAngeli, PBuccioni, MCilia, APoggesi, EFossa, PBrasili, L Discovery of a new series of 5-HT1A receptor agonists. Bioorg Med Chem Lett 20:2017-20 (2010)  
Target
Name:
Alpha-1D adrenergic receptor
Synonyms:
ADA1D_HUMAN ADRA1D Adrenergic receptor alpha Alpha 1D-adrenoreceptor Alpha-1D adrenoceptor adrenergic Alpha1D
Type:
Enzyme Catalytic Domain
Mol. Mass.:
60485.82
Organism:
Homo sapiens (Human)
Description:
adrenergic Alpha1D ADRA1D HUMAN::P25100
Residue:
572
  
Inhibitor
Name:
BDBM50409811
Synonyms:
CHEMBL1082862 | CHEMBL286003
Type:
Small organic molecule
Emp. Form.:
C25H27NO4
Mol. Mass.:
405.4862
SMILES:
COc1ccccc1OCCNCC1COC(O1)(c1ccccc1)c1ccccc1
: