Target
Glucocorticoid receptor
Ligand
BDBM50415793
Substrate
Meas. Tech.
ChEMBL_625087 (CHEMBL1112536)
IC50
200±n/a nM
Citation
 Rimland, JDunne, AHunjan, SSSasse, RUings, IMontanari, DCaivano, MShah, PStanding, DGray, DBrown, DCairns, WTrump, RSmith, PWBertheleme, ND'Alessandro, PGul, SVimal, MSmith, DNWatson, SP The identification a novel, selective, non-steroidal, functional glucocorticoid receptor antagonist. Bioorg Med Chem Lett 20:2340-3 (2010)  
Target
Name:
Glucocorticoid receptor
Synonyms:
GCR_HUMAN GRL Glucocorticoid receptor (GRFP) Nuclear receptor subfamily 3 group C member 1
Type:
Enzyme
Mol. Mass.:
85656.87
Organism:
Homo sapiens (Human)
Description:
P04150
Residue:
777
  
Inhibitor
Name:
BDBM50415793
Synonyms:
CHEMBL1089744
Type:
Small organic molecule
Emp. Form.:
C18H19ClN4O
Mol. Mass.:
342.823
SMILES:
Cc1nn(C)c2ncc(C(=O)NCc3cc(C)cc(C)c3)c(Cl)c12
: