Target
Mineralocorticoid receptor
Ligand
BDBM50415790
Substrate
Meas. Tech.
ChEMBL_625092 (CHEMBL1112541)
EC50
>19952.62±n/a nM
Citation
 Rimland, JDunne, AHunjan, SSSasse, RUings, IMontanari, DCaivano, MShah, PStanding, DGray, DBrown, DCairns, WTrump, RSmith, PWBertheleme, ND'Alessandro, PGul, SVimal, MSmith, DNWatson, SP The identification a novel, selective, non-steroidal, functional glucocorticoid receptor antagonist. Bioorg Med Chem Lett 20:2340-3 (2010)  
Target
Name:
Mineralocorticoid receptor
Synonyms:
MCR MLR NR3C2 | Nuclear receptor subfamily 3 group C member 2
Type:
Enzyme
Mol. Mass.:
107076.42
Organism:
Homo sapiens (Human)
Description:
P08235
Residue:
984
  
Inhibitor
Name:
BDBM50415790
Synonyms:
CHEMBL1093774 US10272074, Example 115
Type:
Small organic molecule
Emp. Form.:
C21H20ClN5O2
Mol. Mass.:
409.869
SMILES:
Cc1noc(C)c1-c1ccc(CNC(=O)c2cnc3n(C)nc(C)c3c2Cl)cc1
: