Target
Thymidylate synthase
Ligand
BDBM50415842
Substrate
Meas. Tech.
ChEMBL_628669 (CHEMBL1106435)
IC50
417±n/a nM
Citation
 Srivastava, VGupta, SPSiddiqi, MIMishra, BN 3D-QSAR studies on quinazoline antifolate thymidylate synthase inhibitors by CoMFA and CoMSIA models. Eur J Med Chem 45:1560-71 (2010)  
Target
Name:
Thymidylate synthase
Synonyms:
TS TYMS Thymidylate synthase (TS) | Thymidylate synthase/GAR transformylase/AICAR transformylase
Type:
Enzyme
Mol. Mass.:
35718.07
Organism:
Homo sapiens (Human)
Description:
Residue:
313
  
Inhibitor
Name:
BDBM50415842
Synonyms:
CHEMBL1097598
Type:
Small organic molecule
Emp. Form.:
C20H21N5O6S
Mol. Mass.:
459.476
SMILES:
CN(Cc1ccc2nc(C)[nH]c(=O)c2c1)c1cnc(s1)C(=O)N[C@@H](CCC(O)=O)C(O)=O
: