Target
Histamine H2 receptor
Ligand
BDBM50415919
Substrate
Meas. Tech.
ChEMBL_629743 (CHEMBL1121103)
EC50
28.84±n/a nM
Citation
 Ghorai, PKraus, ABirnkammer, TGeyer, RBernhardt, GDove, SSeifert, RElz, SBuschauer, A Chiral NG-acylated hetarylpropylguanidine-type histamine H2 receptor agonists do not show significant stereoselectivity. Bioorg Med Chem Lett 20:3173-6 (2010)  
Target
Name:
Histamine H2 receptor
Synonyms:
Gastric receptor I HISTAMINE H2 HRH2_HUMAN Histamine H2-Gs alpha S
Type:
G Protein-Coupled Receptor (GPCR)
Mol. Mass.:
40115.31
Organism:
Homo sapiens (Human)
Description:
Residue:
359
  
Inhibitor
Name:
BDBM50415919
Synonyms:
CHEMBL1094144
Type:
Small organic molecule
Emp. Form.:
C18H31N5OS
Mol. Mass.:
365.537
SMILES:
C[C@@H](CC(=O)NC(N)=NCCCc1sc(N)nc1C)C1CCCCC1
: