Target
Histamine H2 receptor
Ligand
BDBM50415919
Substrate
Meas. Tech.
ChEMBL_629745 (CHEMBL1121257)
EC50
14.13±n/a nM
Citation
 Ghorai, PKraus, ABirnkammer, TGeyer, RBernhardt, GDove, SSeifert, RElz, SBuschauer, A Chiral NG-acylated hetarylpropylguanidine-type histamine H2 receptor agonists do not show significant stereoselectivity. Bioorg Med Chem Lett 20:3173-6 (2010)  
Target
Name:
Histamine H2 receptor
Synonyms:
Gastric receptor I HISTAMINE H2 HRH2_CAVPO | Histamine H2-Gs alpha S
Type:
G Protein-Coupled Receptor (GPCR)
Mol. Mass.:
40567.22
Organism:
Cavia porcellus (domestic guinea pig)
Description:
For the H2 receptor-binding assays, guinea pig striatum was used.
Residue:
359
  
Inhibitor
Name:
BDBM50415919
Synonyms:
CHEMBL1094144
Type:
Small organic molecule
Emp. Form.:
C18H31N5OS
Mol. Mass.:
365.537
SMILES:
C[C@@H](CC(=O)NC(N)=NCCCc1sc(N)nc1C)C1CCCCC1
: