Target
Substance-K receptor
Ligand
BDBM50412318
Substrate
Meas. Tech.
ChEMBL_633592 (CHEMBL1120420)
Ki
0.316±n/a nM
Citation
 Fattori, DPorcelloni, MD'Andrea, PCatalioto, RMEttorre, AGiuliani, SMarastoni, EMauro, SMeini, SRossi, CAltamura, MMaggi, CA Structure-activity relationships of 6-methyl-benzo[b]thiophene-2-carboxylic acid (1-[(S)-1-benzyl-4-[4-(tetrahydropyran-4-ylmethyl)piperazin-1-yl]butylcarbamoyl]cyclopentyl)amide, potent antagonist of the neurokinin-2 receptor. J Med Chem 53:4148-65 (2010)  
Target
Name:
Substance-K receptor
Synonyms:
NK-2 receptor NK2R NKNAR Neurokinin A receptor Neurokinin-2 (NK-2) SKR TACR2 Tachykinin receptor 2 (NK2) | hnk-3
Type:
Protein
Mol. Mass.:
44455.78
Organism:
Homo sapiens (Human)
Description:
P21452
Residue:
398
  
Inhibitor
Name:
BDBM50412318
Synonyms:
CHEMBL447439 | MEN-15702
Type:
Small organic molecule
Emp. Form.:
C41H52N4O4
Mol. Mass.:
664.876
SMILES:
Cc1ccc(cc1)-c1ccc(cc1)C(=O)NC1(CCCC1)C(=O)N[C@H](Cc1ccccc1)C(=O)NCC1CCN(CC2CCOCC2)CC1
: