Target
Substance-K receptor
Ligand
BDBM50415936
Substrate
Meas. Tech.
ChEMBL_633592 (CHEMBL1120420)
Ki
0.316±n/a nM
Citation
 Fattori, DPorcelloni, MD'Andrea, PCatalioto, RMEttorre, AGiuliani, SMarastoni, EMauro, SMeini, SRossi, CAltamura, MMaggi, CA Structure-activity relationships of 6-methyl-benzo[b]thiophene-2-carboxylic acid (1-[(S)-1-benzyl-4-[4-(tetrahydropyran-4-ylmethyl)piperazin-1-yl]butylcarbamoyl]cyclopentyl)amide, potent antagonist of the neurokinin-2 receptor. J Med Chem 53:4148-65 (2010)  
Target
Name:
Substance-K receptor
Synonyms:
NK-2 receptor NK2R NKNAR Neurokinin A receptor Neurokinin-2 (NK-2) SKR TACR2 Tachykinin receptor 2 (NK2) | hnk-3
Type:
Protein
Mol. Mass.:
44455.78
Organism:
Homo sapiens (Human)
Description:
P21452
Residue:
398
  
Inhibitor
Name:
BDBM50415936
Synonyms:
CHEMBL1083877
Type:
Small organic molecule
Emp. Form.:
C34H44N8O2S
Mol. Mass.:
628.831
SMILES:
Cc1ccc2cc(sc2c1)C(=O)NC1(CCCC1)C(=O)N[C@@H](CCCN1CCN(Cc2nnn(C)n2)CC1)Cc1ccccc1
: