Target
5-hydroxytryptamine receptor 6
Ligand
BDBM50416015
Substrate
Meas. Tech.
ChEMBL_635521 (CHEMBL1118104)
Ki
0.1±n/a nM
Citation
 Harris, RNStabler, RSRepke, DBKress, JMWalker, KAMartin, RSBrothers, JMIlnicka, MLee, SWMirzadegan, T Highly potent, non-basic 5-HT6 ligands. Site mutagenesis evidence for a second binding mode at 5-HT6 for antagonism. Bioorg Med Chem Lett 20:3436-40 (2010)  
Target
Name:
5-hydroxytryptamine receptor 6
Synonyms:
5-HT-6 5-hydroxytryptamine receptor 6 (5-HT-6) 5-hydroxytryptamine receptor 6 (5HT6) HTR6 Serotonin 6 (5-HT6) receptor | Serotonin Receptor 6
Type:
G Protein-Coupled Receptor (GPCR)
Mol. Mass.:
46968.43
Organism:
Homo sapiens (Human)
Description:
P50406
Residue:
440
  
Inhibitor
Name:
BDBM50416015
Synonyms:
CHEMBL1086113
Type:
Small organic molecule
Emp. Form.:
C20H20FN3O3S
Mol. Mass.:
401.455
SMILES:
Oc1c[nH]c(NC[C@@H]2CCCc3cc(ccc23)S(=O)(=O)c2cccc(F)c2)n1
: