Target
Muscarinic acetylcholine receptor M1
Ligand
BDBM50416170
Substrate
Meas. Tech.
ChEMBL_635221 (CHEMBL1117832)
EC50
15.85±n/a nM
Citation
 Budzik, BGarzya, VShi, DWalker, GLauchart, YLucas, AJRivero, RALangmead, CJWatson, JWu, ZForbes, ITJin, J 2' biaryl amides as novel and subtype selective M1 agonists. Part II: Further optimization and profiling. Bioorg Med Chem Lett 20:3545-9 (2010)  
Target
Name:
Muscarinic acetylcholine receptor M1
Synonyms:
ACM1_HUMAN Cholinergic receptor, muscarinic 1 | Cholinergic, muscarinic M1
Type:
Protein
Mol. Mass.:
51442.54
Organism:
Homo sapiens (Human)
Description:
P11229
Residue:
460
  
Inhibitor
Name:
BDBM50416170
Synonyms:
CHEMBL1082680
Type:
Small organic molecule
Emp. Form.:
C19H20ClFN2O
Mol. Mass.:
346.826
SMILES:
Fc1cccc(-c2cccc(Cl)c2)c1C(=O)NCC1CCNCC1
: