Target
Urotensin-2
Ligand
BDBM50416338
Substrate
Meas. Tech.
ChEMBL_643307 (CHEMBL1177478)
EC50
1737.8±n/a nM
Citation
 Lehmann, FCurrier, EAOlsson, RMa, JNBurstein, ESHacksell, ULuthman, K Optimization of isochromanone based urotensin II receptor agonists. Bioorg Med Chem 18:4844-54 (2011)  
Target
Name:
Urotensin-2
Synonyms:
UTS2 | UTS2_HUMAN
Type:
PROTEIN
Mol. Mass.:
14297.49
Organism:
Homo sapiens (Human)
Description:
ChEMBL_643307
Residue:
124
  
Inhibitor
Name:
BDBM50416338
Synonyms:
CHEMBL1172604
Type:
Small organic molecule
Emp. Form.:
C21H24ClNO3
Mol. Mass.:
373.873
SMILES:
COc1ccc2C(=O)OC(CCN(C)C)(Cc2c1C)c1ccc(Cl)cc1
: