Target
Muscarinic acetylcholine receptor M5
Ligand
BDBM50416729
Substrate
Meas. Tech.
ChEMBL_652867 (CHEMBL1226070)
EC50
316.23±n/a nM
Citation
 Johnson, DJForbes, ITWatson, SPGarzya, VStevenson, GIWalker, GRMudhar, HSFlynn, STWyman, PASmith, PWMurkitt, GSLucas, AJMookherjee, CRWatson, JMGartlon, JEBradford, AMBrown, F The discovery of a series of N-substituted 3-(4-piperidinyl)-1,3-benzoxazolinones and oxindoles as highly brain penetrant, selective muscarinic M1 agonists. Bioorg Med Chem Lett 20:5434-8 (2010)  
Target
Name:
Muscarinic acetylcholine receptor M5
Synonyms:
ACM5_HUMAN | CHRM5
Type:
PROTEIN
Mol. Mass.:
60102.35
Organism:
Homo sapiens (Human)
Description:
ChEMBL_1517990
Residue:
532
  
Inhibitor
Name:
BDBM50416729
Synonyms:
CHEMBL1223939
Type:
Small organic molecule
Emp. Form.:
C23H34N2O5S
Mol. Mass.:
450.591
SMILES:
CCCO[C@H]1CC[C@@](C)(CC1)N1CCC(CC1)n1c2cc(ccc2oc1=O)S(C)(=O)=O
: