Target
Muscarinic acetylcholine receptor M4
Ligand
BDBM50416732
Substrate
Meas. Tech.
ChEMBL_652866 (CHEMBL1226069)
EC50
12.59±n/a nM
Citation
 Johnson, DJForbes, ITWatson, SPGarzya, VStevenson, GIWalker, GRMudhar, HSFlynn, STWyman, PASmith, PWMurkitt, GSLucas, AJMookherjee, CRWatson, JMGartlon, JEBradford, AMBrown, F The discovery of a series of N-substituted 3-(4-piperidinyl)-1,3-benzoxazolinones and oxindoles as highly brain penetrant, selective muscarinic M1 agonists. Bioorg Med Chem Lett 20:5434-8 (2010)  
Target
Name:
Muscarinic acetylcholine receptor M4
Synonyms:
ACM4_HUMAN Cholinergic, muscarinic M4 Muscarinic acetylcholine receptor M2 and M4
Type:
Enzyme Catalytic Domain
Mol. Mass.:
53079.31
Organism:
Homo sapiens (Human)
Description:
Cholinergic, muscarinic M4 CHRM4 HUMAN M3::P08173
Residue:
479
  
Inhibitor
Name:
BDBM50416732
Synonyms:
CHEMBL1223754
Type:
Small organic molecule
Emp. Form.:
C23H34FN3O2
Mol. Mass.:
403.5334
SMILES:
CCCO[C@H]1CC[C@@](C)(CC1)N1CCC(CC1)n1c2cc(C)c(F)cc2[nH]c1=O
: