Target
Angiopoietin-1 receptor
Ligand
BDBM5814
Substrate
Meas. Tech.
ChEMBL_654561 (CHEMBL1243605)
IC50
28.18±n/a nM
Citation
 Cao, HZhang, HZheng, XGao, D 3D QSAR studies on a series of potent and high selective inhibitors for three kinases of RTK family. J Mol Graph Model 26:236-45 (2007)  
Target
Name:
Angiopoietin-1 receptor
Synonyms:
TEK TIE2_HUMAN Tyrosine-protein kinase receptor (TIE-2) Tyrosine-protein kinase receptor TEK (p140 TEK) Tyrosine-protein kinase receptor TIE2/TEK VMCM1 p140 TEK
Type:
Enzyme
Mol. Mass.:
125835.70
Organism:
Homo sapiens (Human)
Description:
Q02763
Residue:
1124
  
Inhibitor
Name:
BDBM5814
Synonyms:
3-{4-[4-amino-6-(4-methoxyphenyl)furo[2,3-d]pyrimidin-5-yl]phenyl}-1-phenylurea | furo[2,3-d]pyrimidine deriv. 7j
Type:
Small organic molecule
Emp. Form.:
C26H21N5O3
Mol. Mass.:
451.4766
SMILES:
COc1ccc(cc1)-c1oc2ncnc(N)c2c1-c1ccc(NC(=O)Nc2ccccc2)cc1
: