Target
Alpha-1D adrenergic receptor
Ligand
BDBM50416862
Substrate
Meas. Tech.
ChEMBL_663469 (CHEMBL1251068)
Ki
3.98±n/a nM
Citation
 Carrieri, APiergentili, ADel Bello, FGiannella, MPigini, MLeonardi, AFanelli, FQuaglia, W Structure-activity relationships in 1,4-benzodioxan-related compounds. 10. Novela1-adrenoreceptor antagonists related to openphendioxan: synthesis, biological evaluation, anda1d computational study. Bioorg Med Chem 18:7065-77 (2010)  
Target
Name:
Alpha-1D adrenergic receptor
Synonyms:
ADA1D_HUMAN ADRA1D Adrenergic receptor alpha Alpha 1D-adrenoreceptor Alpha-1D adrenoceptor adrenergic Alpha1D
Type:
Enzyme Catalytic Domain
Mol. Mass.:
60485.82
Organism:
Homo sapiens (Human)
Description:
adrenergic Alpha1D ADRA1D HUMAN::P25100
Residue:
572
  
Inhibitor
Name:
BDBM50416862
Synonyms:
CHEMBL1254915
Type:
Small organic molecule
Emp. Form.:
C24H27NO4
Mol. Mass.:
393.4755
SMILES:
COc1ccccc1OCCNCCOc1ccccc1OCc1ccccc1
: