Target
Extracellular calcium-sensing receptor
Ligand
BDBM50416874
Substrate
Meas. Tech.
ChEMBL_664261 (CHEMBL1261768)
EC50
10±n/a nM
Citation
 Gustafsson, MJensen, JBertozzi, SMCurrier, EAMa, JNBurstein, ESOlsson, R Discovery of a class of calcium sensing receptor positive allosteric modulators; 1-(benzothiazol-2-yl)-1-phenylethanols. Bioorg Med Chem Lett 20:5918-21 (2010)  
Target
Name:
Extracellular calcium-sensing receptor
Synonyms:
CASR CaR Calcium-sensing receptor (CaSR) GPRC2A Parathyroid Cell calcium-sensing receptor Synonyms=GPRC2A | hCasR
Type:
Protein
Mol. Mass.:
120663.13
Organism:
Homo sapiens (Human)
Description:
P41180
Residue:
1078
  
Inhibitor
Name:
BDBM50416874
Synonyms:
CHEMBL1256368
Type:
Small organic molecule
Emp. Form.:
C17H17NOS
Mol. Mass.:
283.388
SMILES:
Cc1ccc(c(C)c1)[C@](C)(O)c1nc2ccccc2s1
: