Target
Neuronal acetylcholine receptor subunit alpha-7
Ligand
BDBM50417096
Substrate
Meas. Tech.
ChEMBL_665340 (CHEMBL1261017)
Ki
43.65±n/a nM
Citation
 de Kloe, GERetra, KGeitmann, MKällblad, PNahar, Tvan Elk, RSmit, ABvan Muijlwijk-Koezen, JELeurs, RIrth, HDanielson, UHde Esch, IJ Surface plasmon resonance biosensor based fragment screening using acetylcholine binding protein identifies ligand efficiency hot spots (LE hot spots) by deconstruction of nicotinic acetylcholine receptora7 ligands. J Med Chem 53:7192-201 (2010)  
Target
Name:
Neuronal acetylcholine receptor subunit alpha-7
Synonyms:
ACHA7_HUMAN Cholinergic, Nicotinic Alpha7 Neuronal acetylcholine receptor protein alpha-7 subunit Nicotinic acetylcholine receptor alpha-7 (alpha7 nAChR)
Type:
Mol. Mass.:
56448.33
Organism:
Homo sapiens (Human)
Description:
CHRNA7 (NACHRA7)
Residue:
502
  
Inhibitor
Name:
BDBM50417096
Synonyms:
CHEMBL1256000
Type:
Small organic molecule
Emp. Form.:
C14H18BrN3O
Mol. Mass.:
324.216
SMILES:
Brc1ccc(NC(=O)N[C@H]2CN3CCC2CC3)cc1
: