Target
Acetylcholine-binding protein
Ligand
BDBM50417098
Substrate
Meas. Tech.
ChEMBL_665337 (CHEMBL1261014)
Kd
74131±n/a nM
Citation
 de Kloe, GERetra, KGeitmann, MKällblad, PNahar, Tvan Elk, RSmit, ABvan Muijlwijk-Koezen, JELeurs, RIrth, HDanielson, UHde Esch, IJ Surface plasmon resonance biosensor based fragment screening using acetylcholine binding protein identifies ligand efficiency hot spots (LE hot spots) by deconstruction of nicotinic acetylcholine receptora7 ligands. J Med Chem 53:7192-201 (2010)  
Target
Name:
Acetylcholine-binding protein
Synonyms:
ACHP_LYMST Acetylcholine Binding protein Acetylcholine-binding protein (Ls-AchBP) | AchBP
Type:
Mol. Mass.:
26055.52
Organism:
Lymnaea stagnalis
Description:
Soluble acetylcholine receptor
Residue:
229
  
Inhibitor
Name:
BDBM50417098
Synonyms:
CHEMBL1256003
Type:
Small organic molecule
Emp. Form.:
C7H14N2
Mol. Mass.:
126.1995
SMILES:
N[C@H]1CN2CCC1CC2
: