Target
P2X purinoceptor 7
Ligand
BDBM50417273
Substrate
Meas. Tech.
ChEMBL_676096 (CHEMBL1273090)
IC50
2.51±n/a nM
Citation
 Abberley, LBebius, ABeswick, PJBillinton, ACollis, KLDean, DKFonfria, EGleave, RJMedhurst, SJMichel, ADMoses, APPatel, SRoman, SAScoccitti, TSmith, BSteadman, JGWalter, DS Identification of 2-oxo-N-(phenylmethyl)-4-imidazolidinecarboxamide antagonists of the P2X(7) receptor. Bioorg Med Chem Lett 20:6370-4 (2010)  
Target
Name:
P2X purinoceptor 7
Synonyms:
ATP receptor P2RX7_HUMAN P2X purinoceptor 7 (P2X7) P2Z receptor | Purinergic receptor
Type:
Protein
Mol. Mass.:
68602.85
Organism:
Homo sapiens (Human)
Description:
Q99572
Residue:
595
  
Inhibitor
Name:
BDBM50417273
Synonyms:
CHEMBL1271885
Type:
Small organic molecule
Emp. Form.:
C17H17ClF3N5O2
Mol. Mass.:
415.797
SMILES:
CN1[C@@H](CN(C1=O)c1cn(C)cn1)C(=O)NCc1cccc(c1Cl)C(F)(F)F
: