Target
Amine oxidase [flavin-containing] B
Ligand
BDBM15581
Substrate
Meas. Tech.
ChEMBL_676160 (CHEMBL1273211)
IC50
61660±n/a nM
Citation
 Fioravanti, RBolasco, AManna, FRossi, FOrallo, FYáñez, MVitali, AOrtuso, FAlcaro, S Synthesis and molecular modelling studies of prenylated pyrazolines as MAO-B inhibitors. Bioorg Med Chem Lett 20:6479-82 (2010)  
Target
Name:
Amine oxidase [flavin-containing] B
Synonyms:
AOFB_HUMAN MAOB Monoamine oxidase type B (MAO B) Monoamine oxidase type B (MAOB)
Type:
Protein
Mol. Mass.:
58768.76
Organism:
Homo sapiens (Human)
Description:
P27338
Residue:
520
  
Inhibitor
Name:
BDBM15581
Synonyms:
CHEMBL8706 CLORGILINE N-[3-(2,4-dichlorophenoxy)propyl]-N-methyl-prop-2-yn-1-amine US9603833, Clorgyline | [3-(2,4-dichlorophenoxy)propyl](methyl)prop-2-yn-1-ylamine
Type:
Small organic molecule
Emp. Form.:
C13H15Cl2NO
Mol. Mass.:
272.17
SMILES:
CN(CCCOc1ccc(Cl)cc1Cl)CC#C
: