Target
Alpha-2B adrenergic receptor
Ligand
BDBM50016897
Substrate
Meas. Tech.
ChEMBL_684818 (CHEMBL1286048)
EC50
1175±n/a nM
Citation
 Del Bello, FMattioli, LGhelfi, FGiannella, MPiergentili, AQuaglia, WCardinaletti, CPerfumi, MThomas, RJZanelli, UMarchioro, CDal Cin, MPigini, M Fruitful adrenergica(2C)-agonism/a(2A)-antagonism combination to prevent and contrast morphine tolerance and dependence. J Med Chem 53:7825-35 (2010)  
Target
Name:
Alpha-2B adrenergic receptor
Synonyms:
ADA2B_HUMAN ADRA2L1 Adrenergic alpha2B Adrenergic receptor alpha Alpha-2 adrenergic receptor subtype C2 Alpha-2B adrenoreceptor | Alpha-2BAR
Type:
Enzyme
Mol. Mass.:
49964.20
Organism:
Homo sapiens (Human)
Description:
P18089
Residue:
450
  
Inhibitor
Name:
BDBM50016897
Synonyms:
2-(2,6-dichloroanilino)-1,3-diazacyclopentene-(2) CLONIDINE clonidine (amino form)
Type:
Small organic molecule
Emp. Form.:
C9H9Cl2N3
Mol. Mass.:
230.094
SMILES:
Clc1cccc(Cl)c1\[#7]=[#6]-1\[#7]-[#6]-[#6]-[#7]-1
: