Target
5-hydroxytryptamine receptor 1D
Ligand
BDBM50417424
Substrate
Meas. Tech.
ChEMBL_686387 (CHEMBL1293143)
Ki
0.126±n/a nM
Citation
 Bromidge, SMArban, RBertani, BBorriello, MCapelli, AMDi-Fabio, RFaedo, SGianotti, MGordon, LJGranci, EPasquarello, ASpada, SKWorby, AZonzini, LZucchelli, V 5-{2-[4-(2-methyl-5-quinolinyl)-1-piperazinyl]ethyl}-2(1H)-quinolinones and 3,4-dihydro-2(1H)-quinolinones: dual-acting 5-HT1 receptor antagonists and serotonin reuptake inhibitors. Part 3. Bioorg Med Chem Lett 20:7092-6 (2010)  
Target
Name:
5-hydroxytryptamine receptor 1D
Synonyms:
5-HT-1D 5-HT1D 5HT1D_HUMAN HTR1DA Serotonin (5-HT) receptor | Serotonin Receptor 1D
Type:
G Protein-Coupled Receptor (GPCR)
Mol. Mass.:
41920.63
Organism:
Homo sapiens (Human)
Description:
Receptor binding assays were performed using human clone stably expressed in CHO cells.
Residue:
377
  
Inhibitor
Name:
BDBM50417424
Synonyms:
CHEMBL1289394
Type:
Small organic molecule
Emp. Form.:
C27H29FN4O
Mol. Mass.:
444.5438
SMILES:
C[C@@H]1CN(CCN1CCc1cccc2n(C)c(=O)ccc12)c1cc(F)cc2nc(C)ccc12
: