Target
Muscarinic acetylcholine receptor M3
Ligand
BDBM50417438
Substrate
Meas. Tech.
ChEMBL_687865 (CHEMBL1291429)
IC50
1.26±n/a nM
Citation
 Stocks, MJAlcaraz, LBailey, ABowers, KDonald, DEdwards, HHunt, FKindon, NPairaudeau, GTheaker, JWarner, DJ The discovery of new spirocyclic muscarinic M3 antagonists. Bioorg Med Chem Lett 20:7458-61 (2010)  
Target
Name:
Muscarinic acetylcholine receptor M3
Synonyms:
ACM3_HUMAN Cholinergic, muscarinic M3 Muscarinic receptor M3 | RecName: Full=Muscarinic acetylcholine receptor M3
Type:
Enzyme
Mol. Mass.:
66151.03
Organism:
Homo sapiens (Human)
Description:
P20309
Residue:
590
  
Inhibitor
Name:
BDBM50417438
Synonyms:
CHEMBL1289653
Type:
Small organic molecule
Emp. Form.:
C20H24ClN3O2S
Mol. Mass.:
405.941
SMILES:
Cc1nc(cs1)C(=O)N1CCOC2(CCN(Cc3cccc(Cl)c3)CC2)C1
: