Target
Muscarinic acetylcholine receptor M4
Ligand
BDBM50296331
Substrate
Meas. Tech.
ChEMBL_687868 (CHEMBL1291432)
IC50
0.2±n/a nM
Citation
 Stocks, MJAlcaraz, LBailey, ABowers, KDonald, DEdwards, HHunt, FKindon, NPairaudeau, GTheaker, JWarner, DJ The discovery of new spirocyclic muscarinic M3 antagonists. Bioorg Med Chem Lett 20:7458-61 (2010)  
Target
Name:
Muscarinic acetylcholine receptor M4
Synonyms:
ACM4_HUMAN Cholinergic, muscarinic M4 Muscarinic acetylcholine receptor M2 and M4
Type:
Enzyme Catalytic Domain
Mol. Mass.:
53079.31
Organism:
Homo sapiens (Human)
Description:
Cholinergic, muscarinic M4 CHRM4 HUMAN M3::P08173
Residue:
479
  
Inhibitor
Name:
BDBM50296331
Synonyms:
(3R)-3-{[Hydroxy(di-2-thienyl)acetyl]oxy}-1-(3-phenoxypropyl)-1-azoniabicyclo[2.2.2]octane bromide Aclidinium Tudorza Pressair US9687478, 44
Type:
Small organic molecule
Emp. Form.:
C26H30NO4S2
Mol. Mass.:
484.65
SMILES:
OC(C(=O)O[C@H]1C[N+]2(CCCOc3ccccc3)CCC1CC2)(c1cccs1)c1cccs1
: