Target
Alpha-1D adrenergic receptor
Ligand
BDBM50417539
Substrate
Meas. Tech.
ChEMBL_693739 (CHEMBL1638258)
Ki
17.38±n/a nM
Citation
 Sagratini, GAngeli, PBuccioni, MGulini, UMarucci, GMelchiorre, CPoggesi, EGiardinà, D Synthesis anda1-adrenoceptor antagonist activity of tamsulosin analogues. Eur J Med Chem 45:5800-7 (2010)  
Target
Name:
Alpha-1D adrenergic receptor
Synonyms:
ADA1D_HUMAN ADRA1D Adrenergic receptor alpha Alpha 1D-adrenoreceptor Alpha-1D adrenoceptor adrenergic Alpha1D
Type:
Enzyme Catalytic Domain
Mol. Mass.:
60485.82
Organism:
Homo sapiens (Human)
Description:
adrenergic Alpha1D ADRA1D HUMAN::P25100
Residue:
572
  
Inhibitor
Name:
BDBM50417539
Synonyms:
CHEMBL1630941
Type:
Small organic molecule
Emp. Form.:
C20H26N2O5S
Mol. Mass.:
406.496
SMILES:
COc1ccc(C[C@@H](C)NC[C@H]2Oc3ccccc3O[C@H]2C)cc1S(N)(=O)=O
: