Target
Adenosine receptor A3
Ligand
BDBM50094701
Substrate
Meas. Tech.
ChEMBL_701308 (CHEMBL1648928)
Ki
301995.17±n/a nM
Citation
 Pran Kishore, DBalakumar, CRaghuram Rao, ARoy, PPRoy, K QSAR of adenosine receptor antagonists: Exploring physicochemical requirements for binding of pyrazolo[4,3-e]-1,2,4-triazolo[1,5-c]pyrimidine derivatives with human adenosine A(3) receptor subtype. Bioorg Med Chem Lett 21:818-23 (2011)  
Target
Name:
Adenosine receptor A3
Synonyms:
A3 adenosine receptor (hA3) ADORA3 | Adenosine A3 receptor (A3AR)
Type:
G Protein-Coupled Receptor (GPCR)
Mol. Mass.:
36197.32
Organism:
Homo sapiens (Human)
Description:
P0DMS8
Residue:
318
  
Inhibitor
Name:
BDBM50094701
Synonyms:
2-(furan-2-yl)-8-methyl-8H-pyrazolo[4,3-e][1,2,4]triazolo[1,5-c]pyrimidin-5-amine CHEMBL342059
Type:
Small organic molecule
Emp. Form.:
C11H9N7O
Mol. Mass.:
255.2355
SMILES:
Cn1cc2c(n1)nc(N)n1nc(nc21)-c1ccco1
: