Target
Potassium voltage-gated channel subfamily H member 2
Ligand
BDBM50412171
Substrate
Meas. Tech.
ChEMBL_725152 (CHEMBL1676103)
IC50
12022.64±n/a nM
Citation
 Sinha, NSen, S Predicting hERG activities of compounds from their 3D structures: development and evaluation of a global descriptors based QSAR model. Eur J Med Chem 46:618-30 (2011)  
Target
Name:
Potassium voltage-gated channel subfamily H member 2
Synonyms:
1,3-beta-glucan synthase component GLS2 ERG Eag-related protein 1 Ether-a-go-go-related gene (HERG) Ether-a-go-go-related gene potassium channel 1 Ether-a-go-go-related gene potassium channel 1 (hERG1) Ether-a-go-go-related protein 1 H-ERG KCNH2 Potassium voltage-gated channel subfamily H member 2 (hERG) Voltage-gated potassium channel subunit Kv11.1 hERG Potassium Channel 1 | putative potassium channel subunit
Type:
Multi-pass membrane protein
Mol. Mass.:
126672.65
Organism:
Homo sapiens (Human)
Description:
Q12809
Residue:
1159
  
Inhibitor
Name:
BDBM50412171
Synonyms:
MDL-74156 | Mdl 74156
Type:
Small organic molecule
Emp. Form.:
C19H22N2O3
Mol. Mass.:
326.3896
SMILES:
OC1CN2C3CC(CC2CC1C3)OC(=O)c1c[nH]c2ccccc12
: