Target
Alpha-2C adrenergic receptor
Ligand
BDBM50196131
Substrate
Meas. Tech.
ChEMBL_735955 (CHEMBL1692251)
Ki
8.49±n/a nM
Citation
 Borota, AMracec, MGruia, ARad-Curpan, ROstopovici-Halip, LMracec, M A QSAR study using MTD method and Dragon descriptors for a series of selective ligands ofa2C adrenoceptor. Eur J Med Chem 46:877-84 (2011)  
Target
Name:
Alpha-2C adrenergic receptor
Synonyms:
ADA2C_HUMAN ADRA2L2 Adrenergic alpha2C Adrenergic receptor alpha Alpha-2 adrenergic receptor subtype C4 Alpha-2C adrenoreceptor | adrenergic, alpha-2C-, receptor [Homo sapiens]
Type:
Enzyme
Mol. Mass.:
49552.32
Organism:
Homo sapiens (Human)
Description:
P18825
Residue:
462
  
Inhibitor
Name:
BDBM50196131
Synonyms:
CHEMBL217202 | [4-(3,4-dimethylpiperazin-1-yl)phenyl]-(3-methylquinolin-4-yl)amine
Type:
Small organic molecule
Emp. Form.:
C22H26N4
Mol. Mass.:
346.4686
SMILES:
CC1CN(CCN1C)c1ccc(Nc2c(C)cnc3ccccc23)cc1
: