Target
Alpha-2C adrenergic receptor
Ligand
BDBM50196109
Substrate
Meas. Tech.
ChEMBL_735955 (CHEMBL1692251)
Ki
2.3±n/a nM
Citation
 Borota, AMracec, MGruia, ARad-Curpan, ROstopovici-Halip, LMracec, M A QSAR study using MTD method and Dragon descriptors for a series of selective ligands ofa2C adrenoceptor. Eur J Med Chem 46:877-84 (2011)  
Target
Name:
Alpha-2C adrenergic receptor
Synonyms:
ADA2C_HUMAN ADRA2L2 Adrenergic alpha2C Adrenergic receptor alpha Alpha-2 adrenergic receptor subtype C4 Alpha-2C adrenoreceptor | adrenergic, alpha-2C-, receptor [Homo sapiens]
Type:
Enzyme
Mol. Mass.:
49552.32
Organism:
Homo sapiens (Human)
Description:
P18825
Residue:
462
  
Inhibitor
Name:
BDBM50196109
Synonyms:
(2,3-dimethylquinolin-4-yl)-[4-(octahydro-2H-pyrido[1,2-a]-pyrazin-2-yl)phenyl]amine | CHEMBL425983
Type:
Small organic molecule
Emp. Form.:
C25H30N4
Mol. Mass.:
386.5325
SMILES:
Cc1nc2ccccc2c(Nc2ccc(cc2)N2CCN3CCCCC3C2)c1C
: