Target
Alpha-2C adrenergic receptor
Ligand
BDBM50196113
Substrate
Meas. Tech.
ChEMBL_735955 (CHEMBL1692251)
Ki
15±n/a nM
Citation
 Borota, AMracec, MGruia, ARad-Curpan, ROstopovici-Halip, LMracec, M A QSAR study using MTD method and Dragon descriptors for a series of selective ligands ofa2C adrenoceptor. Eur J Med Chem 46:877-84 (2011)  
Target
Name:
Alpha-2C adrenergic receptor
Synonyms:
ADA2C_HUMAN ADRA2L2 Adrenergic alpha2C Adrenergic receptor alpha Alpha-2 adrenergic receptor subtype C4 Alpha-2C adrenoreceptor | adrenergic, alpha-2C-, receptor [Homo sapiens]
Type:
Enzyme
Mol. Mass.:
49552.32
Organism:
Homo sapiens (Human)
Description:
P18825
Residue:
462
  
Inhibitor
Name:
BDBM50196113
Synonyms:
CHEMBL262901 | [4-(3,4-dimethylpiperazin-1-yl)phenyl]-(2,3,7-trimethylquinolin-4-yl)amine
Type:
Small organic molecule
Emp. Form.:
C24H30N4
Mol. Mass.:
374.5218
SMILES:
CC1CN(CCN1C)c1ccc(Nc2c(C)c(C)nc3cc(C)ccc23)cc1
: