Target
Cytochrome P450 1A1
Ligand
BDBM50027778
Substrate
Meas. Tech.
ChEMBL_774160 (CHEMBL1908255)
Ki
20±n/a nM
Citation
 Fontana, EDansette, PMPoli, SM Cytochrome p450 enzymes mechanism based inhibitors: common sub-structures and reactivity. Curr Drug Metab 6:413-54 (2005)  
Target
Name:
Cytochrome P450 1A1
Synonyms:
CP1A1_RAT Cyp1a1
Type:
PROTEIN
Mol. Mass.:
59401.56
Organism:
Rattus norvegicus
Description:
ChEMBL_774160
Residue:
524
  
Inhibitor
Name:
BDBM50027778
Synonyms:
1-Ethynyl Pyrene | CHEMBL1908230
Type:
Small organic molecule
Emp. Form.:
C18H10
Mol. Mass.:
226.272
SMILES:
C#Cc1ccc2ccc3cccc4ccc1c2c34
: