Target
Cytochrome P450 3A4
Ligand
BDBM23926
Substrate
Meas. Tech.
ChEMBL_738383 (CHEMBL1743460)
Ki
20000±n/a nM
Citation
 Fontana, EDansette, PMPoli, SM Cytochrome p450 enzymes mechanism based inhibitors: common sub-structures and reactivity. Curr Drug Metab 6:413-54 (2005)  
Target
Name:
Cytochrome P450 3A4
Synonyms:
Albendazole monooxygenase CP3A4_HUMAN CYP3A4 CYPIIIA4 Cytochrome P450 3A4 (CYP3A4) Nifedipine oxidase Taurochenodeoxycholate 6-alpha-hydroxylase
Type:
Enzyme
Mol. Mass.:
57349.57
Organism:
Homo sapiens (Human)
Description:
Residue:
503
  
Inhibitor
Name:
BDBM23926
Synonyms:
(E)-resveratrol CHEMBL165 Stilbene, 2f cid_445154 trans-resveratrol
Type:
Small organic molecule
Emp. Form.:
C14H12O3
Mol. Mass.:
228.2433
SMILES:
Oc1ccc(\C=C\c2cc(O)cc(O)c2)cc1
: