Target
Coagulation factor X
Ligand
BDBM12746
Substrate
Meas. Tech.
ChEMBL_743645 (CHEMBL1768188)
Ki
0.2±n/a nM
Citation
 Wawer, MBajorath, J Local structural changes, global data views: graphical substructure-activity relationship trailing. J Med Chem 54:2944-51 (2011)  
Target
Name:
Coagulation factor X
Synonyms:
Activated coagulation factor X (FXa) Coagulation factor X precursor F10 Factor X heavy chain Factor Xa Stuart-Prower factor
Type:
Enzyme
Mol. Mass.:
54726.60
Organism:
Homo sapiens (Human)
Description:
Residue:
488
  
Inhibitor
Name:
BDBM12746
Synonyms:
6-[4-(2-methanesulfonylphenyl)phenyl]-1-(4-methoxyphenyl)-3-(trifluoromethyl)-1H,4H,5H,6H,7H-pyrazolo[3,4-c]pyridin-7-one | dihydropyrazolopyridinone analogue 8c
Type:
Small organic molecule
Emp. Form.:
C27H22F3N3O4S
Mol. Mass.:
541.541
SMILES:
COc1ccc(cc1)-n1nc(c2CCN(C(=O)c12)c1ccc(cc1)-c1ccccc1S(C)(=O)=O)C(F)(F)F
: