Target
Mitogen-activated protein kinase 14
Ligand
BDBM50418610
Substrate
Meas. Tech.
ChEMBL_749955 (CHEMBL1786932)
Ki
63.1±n/a nM
Citation
 Aston, NMBamborough, PBuckton, JBEdwards, CDHolmes, DSJones, KLPatel, VKSmee, PASomers, DOVitulli, GWalker, AL p38alpha mitogen-activated protein kinase inhibitors: optimization of a series of biphenylamides to give a molecule suitable for clinical progression. J Med Chem 52:6257-69 (2009)  
Target
Name:
Mitogen-activated protein kinase 14
Synonyms:
CSAID-binding protein CSBP1 CSPB1 MAP kinase 14 MAP kinase p38 alpha MAPK14 MK14_HUMAN Mitogen-activated protein kinase p38 alpha Stress-activated protein kinase 2a | p38 MAP kinase alpha/beta
Type:
Serine/threonine-protein kinase
Mol. Mass.:
41286.76
Organism:
Homo sapiens (Human)
Description:
Q16539
Residue:
360
  
Inhibitor
Name:
BDBM50418610
Synonyms:
GW-856553 LOSMAPIMOD | US10550073, Comparative example
Type:
Small organic molecule
Emp. Form.:
C22H26FN3O2
Mol. Mass.:
383.4591
SMILES:
Cc1c(F)cc(cc1-c1ccc(cn1)C(=O)NCC(C)(C)C)C(=O)NC1CC1
: