Target
Vasopressin V1a receptor
Ligand
BDBM50418908
Substrate
Meas. Tech.
ChEMBL_758215 (CHEMBL1810552)
Ki
0.525±n/a nM
Citation
 Arbuckle, WBaker, JBarn, DBingham, MBrown, ABuchanan, KCraighead, MGoodwin, RGoutcher, SKiczun, MLyons, AMilne, RMontgomery, BNapier, SPresland, JSloan, HTurnbull, ZWishart, G Optimisation of pharmacokinetic properties to afford an orally bioavailable and selective V1A receptor antagonist. Bioorg Med Chem Lett 21:4622-8 (2011)  
Target
Name:
Vasopressin V1a receptor
Synonyms:
AVPR V1a AVPR1A V1AR_HUMAN VASOPRESSIN V1A Vasopressin V1 receptor Vasopressin receptor
Type:
Receptor
Mol. Mass.:
46820.18
Organism:
Homo sapiens (Human)
Description:
P37288
Residue:
418
  
Inhibitor
Name:
BDBM50418908
Synonyms:
CHEMBL1807268
Type:
Small organic molecule
Emp. Form.:
C28H36ClN3O3
Mol. Mass.:
498.057
SMILES:
COc1ccc(C[C@@H](NC(=O)C2(CC2)c2ccc(Cl)cc2)C(=O)N[C@H]2CC[C@@H](CC2)N(C)C)cc1
: