Target
Beta-2 adrenergic receptor
Ligand
BDBM50418946
Substrate
Meas. Tech.
ChEMBL_759384 (CHEMBL1810622)
EC50
0.063096±n/a nM
Citation
 Connolly, SAlcaraz, LBailey, ACadogan, EChristie, JCook, ARFisher, AJHill, SHumphries, AIngall, AHKane, ZPaine, SPairaudeau, GStocks, MJYoung, A Design-driven LO: the discovery of new ultra long acting dibasicß2-adrenoceptor agonists. Bioorg Med Chem Lett 21:4612-6 (2011)  
Target
Name:
Beta-2 adrenergic receptor
Synonyms:
ADRB2 ADRB2_HUMAN Beta-2 adrenoceptor | Beta-2 adrenoreceptor
Type:
Mol. Mass.:
46461.69
Organism:
Homo sapiens (Human)
Description:
P07550
Residue:
413
  
Inhibitor
Name:
BDBM50418946
Synonyms:
CHEMBL1807817
Type:
Small organic molecule
Emp. Form.:
C22H28N2O4S2
Mol. Mass.:
448.599
SMILES:
O[C@@H](CNCCSCCCOCCc1ccccc1)c1ccc(O)c2[nH]c(=O)sc12
: