Target
D(2) dopamine receptor
Ligand
BDBM50418943
Substrate
Meas. Tech.
ChEMBL_759383 (CHEMBL1810621)
IC50
794±n/a nM
Citation
 Connolly, SAlcaraz, LBailey, ACadogan, EChristie, JCook, ARFisher, AJHill, SHumphries, AIngall, AHKane, ZPaine, SPairaudeau, GStocks, MJYoung, A Design-driven LO: the discovery of new ultra long acting dibasicß2-adrenoceptor agonists. Bioorg Med Chem Lett 21:4612-6 (2011)  
Target
Name:
D(2) dopamine receptor
Synonyms:
D(2) dopamine receptor DOPAMINE D2 Long DRD2 Dopamine D2 receptor Dopamine D2 receptor (D2R) Dopamine2-like | d2
Type:
Cell-surface receptors
Mol. Mass.:
50647.10
Organism:
Homo sapiens (Human)
Description:
P14416
Residue:
443
  
Inhibitor
Name:
BDBM50418943
Synonyms:
CHEMBL1807821
Type:
Small organic molecule
Emp. Form.:
C22H28N2O5S
Mol. Mass.:
432.533
SMILES:
O[C@@H](CNCCCOCCOCCc1ccccc1)c1ccc(O)c2[nH]c(=O)sc12
: