Target
Potassium voltage-gated channel subfamily H member 2
Ligand
BDBM50418183
Substrate
Meas. Tech.
ChEMBL_759400 (CHEMBL1810638)
Ki
6309.57±n/a nM
Citation
 Ratcliffe, PAbernethy, LAnsari, NCameron, KClarkson, TDempster, MDunn, DEasson, AMEdwards, DEverett, KFeilden, HHo, KKKultgen, SLittlewood, PMaclean, JMcArthur, DMcGregor, DMcLuskey, HNeagu, INimz, ONisbet, LAOhlmeyer, MPalin, RPham, QRong, YRoughton, ASammons, MSwanson, RTracey, HWalker, G Discovery of potent, soluble and orally active TRPV1 antagonists. Structure-activity relationships of a series of isoxazoles. Bioorg Med Chem Lett 21:4652-7 (2011)  
Target
Name:
Potassium voltage-gated channel subfamily H member 2
Synonyms:
1,3-beta-glucan synthase component GLS2 ERG Eag-related protein 1 Ether-a-go-go-related gene (HERG) Ether-a-go-go-related gene potassium channel 1 Ether-a-go-go-related gene potassium channel 1 (hERG1) Ether-a-go-go-related protein 1 H-ERG KCNH2 Potassium voltage-gated channel subfamily H member 2 (hERG) Voltage-gated potassium channel subunit Kv11.1 hERG Potassium Channel 1 | putative potassium channel subunit
Type:
Multi-pass membrane protein
Mol. Mass.:
126672.65
Organism:
Homo sapiens (Human)
Description:
Q12809
Residue:
1159
  
Inhibitor
Name:
BDBM50418183
Synonyms:
CHEMBL1761688
Type:
Small organic molecule
Emp. Form.:
C21H26F3N3O3
Mol. Mass.:
425.4446
SMILES:
CC(C)NCc1c(noc1-c1ccc(cc1)C(F)(F)F)C(=O)N[C@@H]1CCC[C@H](O)C1
: