Target
Beta-2 adrenergic receptor
Ligand
BDBM50419015
Substrate
Meas. Tech.
ChEMBL_761245 (CHEMBL1816603)
EC50
2.5±n/a nM
Citation
 Procopiou, PABarrett, VJBevan, NJButchers, PRConroy, REmmons, AFord, AJJeulin, SLooker, BELunniss, GEMorrison, VSMutch, PJPerciaccante, RRuston, MSmith, CESomers, G The discovery of long-acting saligeninß2 adrenergic receptor agonists incorporating hydantoin or uracil rings. Bioorg Med Chem 19:4192-201 (2011)  
Target
Name:
Beta-2 adrenergic receptor
Synonyms:
ADRB2_CAVPO adrenergic Beta2
Type:
Enzyme Catalytic Domain
Mol. Mass.:
46993.24
Organism:
GUINEA PIG
Description:
adrenergic Beta2 ADRB2 GUINEA PIG::Q8K4Z4
Residue:
418
  
Inhibitor
Name:
BDBM50419015
Synonyms:
CHEMBL1814272
Type:
Small organic molecule
Emp. Form.:
C28H39N3O6
Mol. Mass.:
513.6258
SMILES:
OCc1cc(ccc1O)[C@@H](O)CNCCCCCCOCCCCc1cccc(c1)-n1cc(O)[nH]c1=O
: