Target
Beta-1 adrenergic receptor
Ligand
BDBM50419015
Substrate
Meas. Tech.
ChEMBL_761248 (CHEMBL1816606)
EC50
200±n/a nM
Citation
 Procopiou, PABarrett, VJBevan, NJButchers, PRConroy, REmmons, AFord, AJJeulin, SLooker, BELunniss, GEMorrison, VSMutch, PJPerciaccante, RRuston, MSmith, CESomers, G The discovery of long-acting saligeninß2 adrenergic receptor agonists incorporating hydantoin or uracil rings. Bioorg Med Chem 19:4192-201 (2011)  
Target
Name:
Beta-1 adrenergic receptor
Synonyms:
ADRB1 ADRB1_HUMAN Beta-1 adrenoceptor | adrenergic Beta1
Type:
G Protein-Coupled Receptor (GPCR)
Mol. Mass.:
51338.40
Organism:
Homo sapiens (Human)
Description:
P08588
Residue:
477
  
Inhibitor
Name:
BDBM50419015
Synonyms:
CHEMBL1814272
Type:
Small organic molecule
Emp. Form.:
C28H39N3O6
Mol. Mass.:
513.6258
SMILES:
OCc1cc(ccc1O)[C@@H](O)CNCCCCCCOCCCCc1cccc(c1)-n1cc(O)[nH]c1=O
: