Target
Nuclear receptor subfamily 1 group I member 2
Ligand
BDBM50111469
Substrate
Meas. Tech.
ChEMBL_772618 (CHEMBL1839704)
EC50
251.19±n/a nM
Citation
 Morley, ATomkinson, NCook, AMacDonald, CWeaver, RKing, SJenkinson, LUnitt, JMcCrae, CPhillips, T Effect of lipophilicity modulation on inhibition of human rhinovirus capsid binders. Bioorg Med Chem Lett 21:6031-5 (2011)  
Target
Name:
Nuclear receptor subfamily 1 group I member 2
Synonyms:
NR1I2 Orphan nuclear receptor PAR1 PXR SXR nuclear receptor subfamily 1 group I member 2 isoform 1
Type:
Nuclear receptor
Mol. Mass.:
49774.77
Organism:
Homo sapiens (Human)
Description:
O75469
Residue:
434
  
Inhibitor
Name:
BDBM50111469
Synonyms:
3-(3,5-dimethyl-4-(3-(3-methylisoxazol-5-yl)propoxy)phenyl)-5-(trifluoromethyl)-1,2,4-oxadiazole 3-{3,5-Dimethyl-4-[3-(3-methyl-isoxazol-5-yl)-propoxy]-phenyl}-5-trifluoromethyl-[1,2,4]oxadiazole(Pleconaril) CHEMBL29609 Pleconaril3-{3,5-Dimethyl-4-[3-(3-methyl-isoxazol-5-yl)-propoxy]-phenyl}-5-trifluoromethyl-[1,2,4]oxadiazole
Type:
Small organic molecule
Emp. Form.:
C18H18F3N3O3
Mol. Mass.:
381.349
SMILES:
Cc1cc(CCCOc2c(C)cc(cc2C)-c2noc(n2)C(F)(F)F)on1
: