Target
Histamine H4 receptor
Ligand
BDBM50419324
Substrate
Meas. Tech.
ChEMBL_775966 (CHEMBL1912709)
Ki
27542.29±n/a nM
Citation
 Wagner, EWittmann, HJElz, SStrasser, A Mepyramine-JNJ7777120-hybrid compounds show high affinity to hH(1)R, but low affinity to hH(4)R. Bioorg Med Chem Lett 21:6274-80 (2011)  
Target
Name:
Histamine H4 receptor
Synonyms:
AXOR35 GPCR105 HH4R HRH4 Histamine H4 receptor Histamine receptor (H3 and H4) SP9144
Type:
G Protein-Coupled Receptor (GPCR)
Mol. Mass.:
44517.02
Organism:
Homo sapiens (Human)
Description:
Binding assays were using CHO cells stably expressing hH4R receptors.
Residue:
390
  
Inhibitor
Name:
BDBM50419324
Synonyms:
CHEMBL1910384
Type:
Small organic molecule
Emp. Form.:
C28H31N5O2
Mol. Mass.:
469.578
SMILES:
COc1ccc(CN(CCN[C@H]2CCN(C2)C(=O)c2cc3ccccc3[nH]2)c2ccccn2)cc1
: