Target
Prostaglandin E2 receptor EP1 subtype
Ligand
BDBM50419408
Substrate
Meas. Tech.
ChEMBL_785558 (CHEMBL1920205)
IC50
7.94±n/a nM
Citation
 Allan, ACBillinton, ABrown, SHChowdhury, AEatherton, AJFieldhouse, CGiblin, GMGoldsmith, PHall, AHurst, DNNaylor, ARawlings, DASime, MScoccitti, TTheobald, PJ Discovery of a novel series of nonacidic benzofuran EP1 receptor antagonists. Bioorg Med Chem Lett 21:4343-8 (2011)  
Target
Name:
Prostaglandin E2 receptor EP1 subtype
Synonyms:
PE2R1_HUMAN PTGER1 Prostaglandin E2 receptor EP1 subtype Prostanoid EP1 receptor
Type:
Enzyme
Mol. Mass.:
41834.57
Organism:
Homo sapiens (Human)
Description:
P34995
Residue:
402
  
Inhibitor
Name:
BDBM50419408
Synonyms:
CHEMBL1915261
Type:
Small organic molecule
Emp. Form.:
C26H26ClN3O3
Mol. Mass.:
463.956
SMILES:
Cc1cc(nn1Cc1cc(Cl)cc2cc(oc12)-c1ccccc1)C(=O)N[C@H]1CC[C@H](O)CC1
: