Target
Prostaglandin E2 receptor EP1 subtype
Ligand
BDBM50419417
Substrate
Meas. Tech.
ChEMBL_785558 (CHEMBL1920205)
IC50
5.01±n/a nM
Citation
 Allan, ACBillinton, ABrown, SHChowdhury, AEatherton, AJFieldhouse, CGiblin, GMGoldsmith, PHall, AHurst, DNNaylor, ARawlings, DASime, MScoccitti, TTheobald, PJ Discovery of a novel series of nonacidic benzofuran EP1 receptor antagonists. Bioorg Med Chem Lett 21:4343-8 (2011)  
Target
Name:
Prostaglandin E2 receptor EP1 subtype
Synonyms:
PE2R1_HUMAN PTGER1 Prostaglandin E2 receptor EP1 subtype Prostanoid EP1 receptor
Type:
Enzyme
Mol. Mass.:
41834.57
Organism:
Homo sapiens (Human)
Description:
P34995
Residue:
402
  
Inhibitor
Name:
BDBM50419417
Synonyms:
CHEMBL1915254
Type:
Small organic molecule
Emp. Form.:
C20H16ClN3O2
Mol. Mass.:
365.813
SMILES:
Cc1cc(nn1Cc1cc(Cl)cc2cc(oc12)-c1ccccc1)C(N)=O
: