Target
Beta-2 adrenergic receptor
Ligand
BDBM50419650
Substrate
Meas. Tech.
ChEMBL_797650 (CHEMBL1943768)
EC50
0.100000±n/a nM
Citation
 Jacobsen, JRChoi, SKCombs, JFournier, EJKlein, UPfeiffer, JWThomas, GRYu, CMoran, EJ A multivalent approach to the discovery of long-actingß(2)-adrenoceptor agonists for the treatment of asthma and COPD. Bioorg Med Chem Lett 22:1213-8 (2012)  
Target
Name:
Beta-2 adrenergic receptor
Synonyms:
ADRB2 ADRB2_HUMAN Beta-2 adrenoceptor | Beta-2 adrenoreceptor
Type:
Mol. Mass.:
46461.69
Organism:
Homo sapiens (Human)
Description:
P07550
Residue:
413
  
Inhibitor
Name:
BDBM50419650
Synonyms:
CHEMBL1940830
Type:
Small organic molecule
Emp. Form.:
C25H30N2O4
Mol. Mass.:
422.5167
SMILES:
OCc1cc(ccc1O)[C@@H](O)CNCCc1ccc(NC[C@H](O)c2ccccc2)cc1
: