Target
Beta-1 adrenergic receptor
Ligand
BDBM25771
Substrate
Meas. Tech.
ChEMBL_797651 (CHEMBL1943769)
EC50
251±n/a nM
Citation
 Jacobsen, JRChoi, SKCombs, JFournier, EJKlein, UPfeiffer, JWThomas, GRYu, CMoran, EJ A multivalent approach to the discovery of long-actingß(2)-adrenoceptor agonists for the treatment of asthma and COPD. Bioorg Med Chem Lett 22:1213-8 (2012)  
Target
Name:
Beta-1 adrenergic receptor
Synonyms:
ADRB1 ADRB1_HUMAN Beta-1 adrenoceptor | adrenergic Beta1
Type:
G Protein-Coupled Receptor (GPCR)
Mol. Mass.:
51338.40
Organism:
Homo sapiens (Human)
Description:
P08588
Residue:
477
  
Inhibitor
Name:
BDBM25771
Synonyms:
1-hydroxy-2-naphthoic acid;4-[1-hydroxy-2-[6-(4-phenylbutoxy)hexylamino]ethyl]-2-methylol-phenol Aeromax Serevent | salmeterol xinafoate
Type:
Small organic molecule
Emp. Form.:
C25H37NO4
Mol. Mass.:
415.5656
SMILES:
OCc1cc(ccc1O)C(O)CNCCCCCCOCCCCc1ccccc1
: