Target
Beta-2 adrenergic receptor
Ligand
BDBM50419675
Substrate
Meas. Tech.
ChEMBL_800669 (CHEMBL1947791)
IC50
2±n/a nM
Citation
 Alcaraz, LBailey, ACadogan, EConnolly, SJewell, RJordan, SKindon, NLister, ALawson, MMullen, ADainty, INicholls, DPaine, SPairaudeau, GStocks, MJThorne, PYoung, A From libraries to candidate: the discovery of new ultra long-acting dibasicß2-adrenoceptor agonists. Bioorg Med Chem Lett 22:689-95 (2011)  
Target
Name:
Beta-2 adrenergic receptor
Synonyms:
ADRB2 ADRB2_HUMAN Beta-2 adrenoceptor | Beta-2 adrenoreceptor
Type:
Mol. Mass.:
46461.69
Organism:
Homo sapiens (Human)
Description:
P07550
Residue:
413
  
Inhibitor
Name:
BDBM50419675
Synonyms:
CHEMBL1945032
Type:
Small organic molecule
Emp. Form.:
C29H32N4O3S
Mol. Mass.:
516.654
SMILES:
Cc1cccc2c(CCNCc3ccc(CCNC[C@H](O)c4ccc(O)c5[nH]c(=O)sc45)cc3)c[nH]c12
: