Target
Alpha-2A adrenergic receptor
Ligand
BDBM50419877
Substrate
Meas. Tech.
ChEMBL_805961 (CHEMBL1960289)
Ki
72±n/a nM
Citation
 Diamanti, EDel Bello, FCarbonara, GCarrieri, AFracchiolla, GGiannella, MMammoli, VPiergentili, APohjanoksa, KQuaglia, WScheinin, MPigini, M Might the observeda(2A)-adrenoreceptor agonism or antagonism of allyphenyline analogues be ascribed to different molecular conformations? Bioorg Med Chem 20:2082-90 (2012)  
Target
Name:
Alpha-2A adrenergic receptor
Synonyms:
ADA2A_HUMAN ADRA2R Adrenergic alpha2A Alpha-2 adrenergic receptor subtype C10 Alpha-2A adrenoreceptor alpha-2A adrenergic receptor [Homo sapiens]
Type:
Enzyme
Mol. Mass.:
48979.91
Organism:
Homo sapiens (Human)
Description:
P08913
Residue:
450
  
Inhibitor
Name:
BDBM50419877
Synonyms:
CHEMBL1956194
Type:
Small organic molecule
Emp. Form.:
C14H18N2O
Mol. Mass.:
230.3055
SMILES:
CC(Oc1ccccc1C(C)=C)C1=NCCN1
: