Target
Free fatty acid receptor 4
Ligand
BDBM22496
Substrate
Meas. Tech.
ChEMBL_830234 (CHEMBL2060785)
EC50
1412.54±n/a nM
Citation
 Shimpukade, BHudson, BDHovgaard, CKMilligan, GUlven, T Discovery of a potent and selective GPR120 agonist. J Med Chem 55:4511-5 (2012)  
Target
Name:
Free fatty acid receptor 4
Synonyms:
FFAR4 G-protein coupled receptor 120 G-protein coupled receptor GT01 GPR120 O3FAR1 PGR4
Type:
PROTEIN
Mol. Mass.:
42256.91
Organism:
Homo sapiens (Human)
Description:
ChEMBL_1508994
Residue:
377
  
Inhibitor
Name:
BDBM22496
Synonyms:
3-(4-{[(3-phenoxyphenyl)methyl]amino}phenyl)propanoic acid carboxylic acid agonist, 2
Type:
Small organic molecule
Emp. Form.:
C22H21NO3
Mol. Mass.:
347.407
SMILES:
OC(=O)CCc1ccc(NCc2cccc(Oc3ccccc3)c2)cc1
: